{"text_format":"1","workbook":"xlsx","n_sheets":3,"sheets":["Instructions","Nufarm Edge Rewards Calculator","Rebate Reference Table"],"not_rendered":{"charts":0,"images":2,"macros":1,"external_links":0,"defined_names":7,"comments":0,"pivot_tables":0},"unopened":[],"bounds":{"document_bytes":16777216,"sheet_cells":100000,"rows_first":2000,"rows_last":500,"rows_between":2000,"halvings":0,"cell_chars":16384,"cell_head_chars":4096},"cells_cut":0,"cells_raw":0,"read":"whole","date_system":"1900"}

{"sheet":"Instructions","index":0,"n_rows":17,"n_cols":2,"rows_kept":17,"cut":false,"hidden":false,"merged":[[1,0,1,1],[2,0,2,1],[0,0,0,1]]}
[]
["Nufarm Edge Rewards Calculator"]
[]
[null,"READ FIRST:   Our new calculator offers collapse-to-print functionality that you'll appreciate,\nbut you must save the file to your PC and select \"enable content\" to enable macros when prompted.\nIf you missed making this selection, close the file and open again."]
[]
[null,"Follow these steps below to calculate your EOP Rebate:"]
[]
[null,"1. Click on the \"Nufarm Edge Rewards Calculator\" tab below."]
[]
[null,"2. Select the \"EOP Period\" and \"Product Segment\", then enter values in \"Price/Unit\" (optional), \"Units\" (required) and \"Own App Rate\" (optional) fields in the table to calculate your Total Rebate."]
[]
[null,"3. Click the \"Hide/Show Blank Rows\" button to hide rows without entered values."]
[]
[null,"4. Print or save the page as a PDF: On Windows: Ctrl + [P] | On Mac: Command + [P]"]
[]
[null,"Help enable macros: "]
[null,"https://support.microsoft.com/en-us/office/vba/enable-or-disable-macros-in-microsoft-365-files"]

{"sheet":"Nufarm Edge Rewards Calculator","index":1,"n_rows":112,"n_cols":18,"rows_kept":112,"cut":false,"hidden":false,"merged":[[68,17,70,17],[34,17,35,17],[15,13,17,13],[18,13,21,13],[0,12,0,13],[4,12,5,17],[7,13,7,15],[30,17,32,17],[76,4,77,4],[92,17,94,17],[88,17,91,17],[92,4,94,4],[82,4,83,4],[85,4,86,4],[85,17,86,17],[82,17,83,17],[88,4,91,4],[47,4,50,4],[8,5,8,7],[72,17,74,17],[37,17,38,17],[60,4,61,4],[65,4,66,4],[60,17,61,17],[65,17,66,17],[47,17,50,17],[8,13,9,15],[40,17,41,17],[40,4,41,4],[15,4,17,4],[15,17,17,17],[18,4,21,4],[18,17,21,17],[129,4,129,6],[109,4,110,4],[109,17,110,17],[23,17,24,17],[23,4,24,4],[72,4,74,4],[78,17,80,17],[78,4,80,4],[26,4,27,4],[26,17,27,17],[68,4,70,4],[52,17,53,17],[56,17,57,17],[58,17,59,17],[54,17,55,17],[106,17,108,17],[106,4,108,4],[43,4,46,4],[43,17,46,17],[54,4,55,4],[56,4,57,4],[52,4,53,4],[58,4,59,4],[99,17,102,17],[95,17,98,17],[99,4,102,4],[103,4,105,4],[95,4,98,4],[103,17,105,17],[63,17,64,17],[76,17,77,17],[63,4,64,4],[0,7,0,9],[7,5,7,7],[9,5,9,7],[5,9,5,10],[5,4,5,7],[6,4,6,7],[6,9,6,10],[1,7,4,9],[2,4,2,5],[34,4,35,4],[30,4,32,4],[37,4,38,4],[10,13,10,15],[10,5,10,7],[12,5,12,7]]}
[null,null,null,null,null,null,null,"Purchase $3,000 of eligible Nufarm Edge Rewards qualifying products between September 1 and December 4, 2026 to earn valuable distributor credit rebates.",null,null,null,null,"IMPORTANT:\nSelect \"Enable Content\" to \nenable macros providing \nnew functionality."]
[null,null,null,null,null,null,null,"Enroll in the Nufarm Edge Rewards (NufarmRewards.com) program from September 1 to December 4, 2026, to be eligible. If previously registered, there's no need to sign up again.\n\nVerify your account and loyalty number by filling out the online registration form at NufarmRewards.com using the same email address you registered with. Account details will be sent via email.\n\n",null,null,null,null,"For product and application details, please visit:"]
[null,null,null,null,"Program Periods:\nEOP 1: Sep 1 - Oct 31, 2026 (Volume Bonus rebates available.)\nEOP 2: Nov 1 - Dec 4, 2026",null,null,null,null,null,null,null,"https://nufarm.com/usturf/"]
[null,null,null,null,"Select EOP Period:","EOP 1",null,null,null,null,null,null,"Turf EZ Solution Pairings"]
[null,null,null,null," Select Product Segment:","All Products",null,null,null,null,null,null,"Turf EZ Solution pairings are your best value combinations available Sep 1 – Dec 4, 2026. Purchase the product combinations at the minimum required quantities on a single invoice. Choose either Anuew EZ or Anuew, then select one pairing, or combine products – Tourney EZ and Traction."]
[]
[null,null,null,null,"Nufarm Edge Rewards Calculator (California)",null,null,null,null,"DRAFT ORDER"]
[null,null,null,null,"Customer:",null,null,null,null,"TOTAL COST",{"$f":"SUM($I$16:$I$112)","v":0},null,"PAIRINGS","PRODUCT 1",null,null,null,"PRODUCT 2"]
[null,null,null,null,"Name:",null,null,null,null,"TOTAL REBATE",{"$f":"SUM($K$16:$K$112)","v":0},null,1,"ANUEW EZ 2.5 gal\n8+ Units\nor\nANUEW 1.5 lb\n48+ Units",null,null,"+","TOURNEY EZ 1 gal\n4+ Units"]
[null,null,null,null,"Date:",null,null,null,null,"ESTIMATED NET TOTAL",{"$f":"IF(K8>K9,K8-K9,\"\")","v":""},null,2,null,null,null,"+","TRACTION 2.5 gal\n6+ Units"]
[null,null,null,null,"Sales Manager:",null,null,null,null,"AVERAGE SAVINGS",{"$f":"IF(K8>K9,K9/K8,\"\")","v":""},null,3,"TRACTION 2.5 gal\n2+ Units",null,null,"+","26/36 2.5 gal\n6+ Units"]
[]
[]
["Turf\nBrochure","Greenhouse\nNursery Brochure","Product","Rebate","PRODUCT","UNIT SIZE","PRICE/UNIT\n(optional)","UNITS\n(required)","TOTAL COST","REBATE / UNIT","SUBTOTAL REBATE",null,"EXAMPLE LOW RATE","EXAMPLE HIGH RATE","MEASURE","OWN APP RATE (optional)","YOUR TREATED ACRES\n(or gallons mix)","NO STATE REGISTRATION\n& (availability)"]
["Plant Growth Regulators","Plant Growth Regulators",null,"Plant Growth Regulators","Plant Growth Regulators"]
["Yes",null,"ANUEW","EOP 1 & 2","ANUEW","1.5 lb. pack",null,null,{"$f":"G16*H16","v":0},{"$f":"IF($F$4=\"EOP 1\", VLOOKUP(C16&F16&$F$4,'Rebate Reference Table'!$E$5:$J$128,3,FALSE), VLOOKUP(C16&F16&$F$4,'Rebate Reference Table'!$F$5:$J$128,5,FALSE))","v":8},{"$f":"H16*J16","v":0},null,2,"12 cool season\n\n16 warm season","oz / A",null,{"$f":"IFERROR(H16*24/P16,\"\")","v":""},"AK, PR"]
["Yes",null,"ANUEW","Volume",null,"1.5 lb. pack Volume 32+",null,null,{"$f":"G17*H17","v":0},{"$f":"IF($F$4=\"EOP 1\", VLOOKUP(C17&F17&$F$4,'Rebate Reference Table'!$E$5:$J$128,4,FALSE), VLOOKUP(C17&F17&$F$4,'Rebate Reference Table'!$F$5:$J$128,5,FALSE))","v":18},0,null,2,null,"oz / A",null,{"$f":"IFERROR(H17*24/P17,\"\")","v":""}]
["Yes",null,"ANUEW","Pairing",null,"1.5 lb. pack Pairing 1 & 2",null,null,0,{"$f":"IF($F$4=\"EOP 1\", VLOOKUP(C18&F18&$F$4,'Rebate Reference Table'!$E$5:$J$128,5,FALSE), VLOOKUP(C18&F18&$F$4,'Rebate Reference Table'!$F$5:$J$128,5,FALSE))","v":25},0,null,2,null,"oz / A",null,{"$f":"IFERROR(H18*24/P18,\"\")","v":""}]
["Yes",null,"ANUEW EZ","EOP 1 & 2","ANUEW EZ","64 fl oz. bottle",null,null,0,{"$f":"IF($F$4=\"EOP 1\", VLOOKUP(C19&F19&$F$4,'Rebate Reference Table'!$E$5:$J$128,3,FALSE), VLOOKUP(C19&F19&$F$4,'Rebate Reference Table'!$F$5:$J$128,5,FALSE))","v":10},0,null,2.2000000000000002,"27 cool season\n\n36 warm season"," fl.oz / A",null,{"$f":"IFERROR(H19*64/P19,\"\")","v":""},"AK, PR"]
["Yes",null,"ANUEW EZ","EOP 1 & 2",null,"2.5 gal. bottle",null,null,0,{"$f":"IF($F$4=\"EOP 1\", VLOOKUP(C20&F20&$F$4,'Rebate Reference Table'!$E$5:$J$128,3,FALSE), VLOOKUP(C20&F20&$F$4,'Rebate Reference Table'!$F$5:$J$128,5,FALSE))","v":48},0,null,2.2000000000000002,null," fl.oz / A",null,{"$f":"IFERROR(H20*320/P20,\"\")","v":""}]
["Yes",null,"ANUEW EZ","Volume",null,"2.5 gal. bottle Volume 6+",null,null,0,{"$f":"IF($F$4=\"EOP 1\", VLOOKUP(C21&F21&$F$4,'Rebate Reference Table'!$E$5:$J$128,4,FALSE), VLOOKUP(C21&F21&$F$4,'Rebate Reference Table'!$F$5:$J$128,5,FALSE))","v":125},0,null,2.2000000000000002,null," fl.oz / A",null,{"$f":"IFERROR(H21*320/P21,\"\")","v":""}]
["Yes",null,"ANUEW EZ","Pairing",null,"2.5 gal. bottle Pairing 1 & 2",null,null,0,{"$f":"IF($F$4=\"EOP 1\", VLOOKUP(C22&F22&$F$4,'Rebate Reference Table'!$E$5:$J$128,5,FALSE), VLOOKUP(C22&F22&$F$4,'Rebate Reference Table'!$F$5:$J$128,5,FALSE))","v":150},0,null,2.2000000000000002,null," fl.oz / A",null,{"$f":"IFERROR(H22*320/P22,\"\")","v":""}]
[null,"Yes","FASCINATION","EOP 1 & 2","FASCINATION","0.5 gal. bottle",null,null,0,{"$f":"IF($F$4=\"EOP 1\", VLOOKUP(C23&F23&$F$4,'Rebate Reference Table'!$E$5:$J$128,3,FALSE), VLOOKUP(C23&F23&$F$4,'Rebate Reference Table'!$F$5:$J$128,5,FALSE))","v":12},0,null,"consult label","consult label","N/A",null,null,"AK, PR"]
[null,"Yes","SUMAGIC","EOP 1 & 2","SUMAGIC","1 gal. bottle",null,null,0,{"$f":"IF($F$4=\"EOP 1\", VLOOKUP(C24&F24&$F$4,'Rebate Reference Table'!$E$5:$J$128,3,FALSE), VLOOKUP(C24&F24&$F$4,'Rebate Reference Table'!$F$5:$J$128,5,FALSE))","v":10},0,null,"consult label","consult label","N/A",null,null,"AK, DC"]
[null,"Yes","SUMAGIC","EOP 1 & 2",null,"15 gal. drum",null,null,{"$f":"G25*H25","v":0},{"$f":"IF($F$4=\"EOP 1\", VLOOKUP(C25&F25&$F$4,'Rebate Reference Table'!$E$5:$J$128,3,FALSE), VLOOKUP(C25&F25&$F$4,'Rebate Reference Table'!$F$5:$J$128,5,FALSE))","v":150},0,null,"consult label","consult label","N/A"]
["Fungicides","Fungicides",null,"Fungicides","Fungicides"]
["Yes","Yes","26/36","EOP 1 & 2","26/36","2.5 gal. bottle",null,null,0,{"$f":"IF($F$4=\"EOP 1\", VLOOKUP(C27&F27&$F$4,'Rebate Reference Table'!$E$5:$J$128,3,FALSE), VLOOKUP(C27&F27&$F$4,'Rebate Reference Table'!$F$5:$J$128,5,FALSE))","v":20},{"$f":"H27*J27","v":0},null,1,8,"fl.oz / 10002",null,{"$f":"IFERROR((H27*320)/(P27*43.56),\"\")","v":""},"AZ, PR"]
["Yes","Yes","26/36","Pairing",null,"2.5 gal. bottle Pairing 3",null,null,0,{"$f":"IF($F$4=\"EOP 1\", VLOOKUP(C28&F28&$F$4,'Rebate Reference Table'!$E$5:$J$128,5,FALSE), VLOOKUP(C28&F28&$F$4,'Rebate Reference Table'!$F$5:$J$128,5,FALSE))","v":30},0,null,1,8,"fl.oz / 10002",null,{"$f":"IFERROR((H28*320)/(P28*43.56),\"\")","v":""}]
["Yes",null,"3336 DG LITE","EOP 1 & 2","3336 DG LITE","30 lb. bag",null,null,0,{"$f":"IF($F$4=\"EOP 1\", VLOOKUP(C29&F29&$F$4,'Rebate Reference Table'!$E$5:$J$128,3,FALSE), VLOOKUP(C29&F29&$F$4,'Rebate Reference Table'!$F$5:$J$128,5,FALSE))","v":3},0,null,1.5,9,"lbs / 10002",null,{"$f":"IFERROR((H29*30)/(P29*43.56),\"\")","v":""},"AK, PR"]
[null,"Yes","3336 EG","EOP 1 & 2","3336 EG","5 lb. bottle",null,null,0,{"$f":"IF($F$4=\"EOP 1\", VLOOKUP(C30&F30&$F$4,'Rebate Reference Table'!$E$5:$J$128,3,FALSE), VLOOKUP(C30&F30&$F$4,'Rebate Reference Table'!$F$5:$J$128,5,FALSE))","v":10},0,null,2,6,"oz / 10002",null,{"$f":"IFERROR((H30*80)/(P30*43.56),\"\")","v":""},"AK, DC, ME, PR"]
["Yes","Yes","3336 F","EOP 1 & 2","3336 F","1 qt. bottle",null,null,0,{"$f":"IF($F$4=\"EOP 1\", VLOOKUP(C31&F31&$F$4,'Rebate Reference Table'!$E$5:$J$128,3,FALSE), VLOOKUP(C31&F31&$F$4,'Rebate Reference Table'!$F$5:$J$128,5,FALSE))","v":3},0,null,8,24,"fl.oz / 100 gal",null,{"$f":"IFERROR(H31*3200/P31,\"\")","v":""},"AK, DC"]
["Yes","Yes","3336 F","EOP 1 & 2",null,"2.5 gal. bottle",null,null,0,{"$f":"IF($F$4=\"EOP 1\", VLOOKUP(C32&F32&$F$4,'Rebate Reference Table'!$E$5:$J$128,3,FALSE), VLOOKUP(C32&F32&$F$4,'Rebate Reference Table'!$F$5:$J$128,5,FALSE))","v":30},0,null,8,24,"fl.oz / 100 gal",null,{"$f":"IFERROR(H32*32000/P32,\"\")","v":""}]
["Yes","Yes","3336 F","Volume",null,"2.5 gal. bottle Volume 4+",null,null,0,{"$f":"IF($F$4=\"EOP 1\", VLOOKUP(C33&F33&$F$4,'Rebate Reference Table'!$E$5:$J$128,4,FALSE), VLOOKUP(C33&F33&$F$4,'Rebate Reference Table'!$F$5:$J$128,5,FALSE))","v":60},0,null,8,24,"fl.oz / 100 gal",null,{"$f":"IFERROR(H33*32000/P33,\"\")","v":""}]
["Yes","Yes","ADORN","EOP 1 & 2","ADORN","1 qt. bottle",null,null,0,{"$f":"IF($F$4=\"EOP 1\", VLOOKUP(C34&F34&$F$4,'Rebate Reference Table'!$E$5:$J$128,3,FALSE), VLOOKUP(C34&F34&$F$4,'Rebate Reference Table'!$F$5:$J$128,5,FALSE))","v":15},0,null,1,4,"fl.oz / 100 gal",null,{"$f":"IFERROR(H34*3200/P34,\"\")","v":""},"HI"]
["Yes","Yes","AFFIRM WDG","EOP 1 & 2","AFFIRM WDG","2.4 lb. bag",null,null,0,{"$f":"IF($F$4=\"EOP 1\", VLOOKUP(C35&F35&$F$4,'Rebate Reference Table'!$E$5:$J$128,3,FALSE), VLOOKUP(C35&F35&$F$4,'Rebate Reference Table'!$F$5:$J$128,5,FALSE))","v":10},0,null,0.88149999999999995,1,"oz / 10002",null,{"$f":"IFERROR((H35*38.4)/(P35*43.56),\"\")","v":""},"PR"]
["Yes","Yes","AFFIRM WDG","Volume",null,"2.4 lb. bag Volume 6+",null,null,0,{"$f":"IF($F$4=\"EOP 1\", VLOOKUP(C36&F36&$F$4,'Rebate Reference Table'!$E$5:$J$128,4,FALSE), VLOOKUP(C36&F36&$F$4,'Rebate Reference Table'!$F$5:$J$128,5,FALSE))","v":25},0,null,0.88149999999999995,1,"oz / 10002",null,{"$f":"IFERROR((H36*38.4)/(P36*43.56),\"\")","v":""}]
[null,"Yes","CHAMPION++","EOP 1 & 2","CHAMPION++","10 lb. bag",null,null,0,{"$f":"IF($F$4=\"EOP 1\", VLOOKUP(C37&F37&$F$4,'Rebate Reference Table'!$E$5:$J$128,3,FALSE), VLOOKUP(C37&F37&$F$4,'Rebate Reference Table'!$F$5:$J$128,5,FALSE))","v":5},0,null,0.8,0.8,"lb / 100 gal",null,{"$f":"IFERROR(H37*1000/P37,\"\")","v":""}]
["Yes",null,"PINPOINT","EOP 1 & 2","PINPOINT","60 fl oz. bottle",null,null,0,{"$f":"IF($F$4=\"EOP 1\", VLOOKUP(C38&F38&$F$4,'Rebate Reference Table'!$E$5:$J$128,3,FALSE), VLOOKUP(C38&F38&$F$4,'Rebate Reference Table'!$F$5:$J$128,5,FALSE))","v":10},0,null,0.27500000000000002,0.31,"fl.oz / 10002",null,{"$f":"IFERROR((H38*60)/(P38*43.56),\"\")","v":""},"HI\nNot for sale, use or distribution in Nassau & Suffolk Counties (No application within 50 ft of water body connected to off-site surface water in NY)"]
["Yes",null,"PINPOINT","Volume",null,"60 fl oz. bottle Volume 8+",null,null,0,{"$f":"IF($F$4=\"EOP 1\", VLOOKUP(C39&F39&$F$4,'Rebate Reference Table'!$E$5:$J$128,4,FALSE), VLOOKUP(C39&F39&$F$4,'Rebate Reference Table'!$F$5:$J$128,5,FALSE))","v":30},0,null,0.27500000000000002,0.31,"fl.oz / 10002",null,{"$f":"IFERROR((H39*60)/(P39*43.56),\"\")","v":""}]
["Yes","Yes","SPECTRO 90 WDG","EOP 1 & 2","SPECTRO 90 WDG","5 lb. bag",null,null,0,{"$f":"IF($F$4=\"EOP 1\", VLOOKUP(C40&F40&$F$4,'Rebate Reference Table'!$E$5:$J$128,3,FALSE), VLOOKUP(C40&F40&$F$4,'Rebate Reference Table'!$F$5:$J$128,5,FALSE))","v":5},0,null,1,2,"lb / 100 gal",null,{"$f":"IFERROR(H40*500/P40,\"\")","v":""},"ME, PR"]
{"$rows_left_out":73}
{"sheet":"Rebate Reference Table","index":2,"n_rows":138,"n_cols":12,"rows_kept":138,"cut":false,"hidden":true,"merged":[]}
["EOP 1",null,null,null,null,null,null,null,null,null,null,"All Products"]
["EOP 2",null,null,null,null,null,null,null,"Pairing EOP 1","Pairing EOP 2",null,"Golf & Turf Products"]
["Item Number","Product Description","Product","Unit Size","Concat EOP 1","Concat EOP 2","EOP 1 Rebate/Unit","EOP 1 Volume Rebate/Unit","Pairing Rebate/Unit","EOP 2 Rebate/Unit",null,"Greenhouse & Nursery Products"]
[null,"Herbicides","Herbicides"]
[10010225,"4-SPEED XT 2x2.5 Gallon Case","4-SPEED XT","2.5 gal. bottle",{"$f":"CONCATENATE(C5,D5,$A$1)","v":"4-SPEED XT2.5 gal. bottleEOP 1"},{"$f":"CONCATENATE(C5,D5,$A$2)","v":"4-SPEED XT2.5 gal. bottleEOP 2"},15,null,null,5]
[10010225,"4-SPEED XT 2x2.5 Gallon Case","4-SPEED XT","2.5 gal. bottle Volume 12+","4-SPEED XT2.5 gal. bottle Volume 12+EOP 1","4-SPEED XT2.5 gal. bottle Volume 12+EOP 2",null,20,null,0]
[10850464,"ALLSTAR 4x64 Fl oz Case","ALLSTAR","64 fl oz. bottle","ALLSTAR64 fl oz. bottleEOP 1","ALLSTAR64 fl oz. bottleEOP 2",7,null,null,5]
[10850225,"ALLSTAR 2x2.5 Gallon Case","ALLSTAR","2.5 gal. bottle","ALLSTAR2.5 gal. bottleEOP 1","ALLSTAR2.5 gal. bottleEOP 2",30,null,null,20]
[10850225,"ALLSTAR 2x2.5 Gallon Case","ALLSTAR","2.5 gal. bottle Volume 6+","ALLSTAR2.5 gal. bottle Volume 6+EOP 1","ALLSTAR2.5 gal. bottle Volume 6+EOP 2",null,35,null,0]
[10850030,"ALLSTAR 30 Gallon Drum","ALLSTAR","30 gal. drum","ALLSTAR30 gal. drumEOP 1","ALLSTAR30 gal. drumEOP 2",420,null,null,240]
[10850265,"ALLSTAR 265 Gallon Tote","ALLSTAR","265 gal. tote",{"$f":"CONCATENATE(C11,D11,$A$1)","v":"ALLSTAR265 gal. toteEOP 1"},{"$f":"CONCATENATE(C11,D11,$A$2)","v":"ALLSTAR265 gal. toteEOP 2"},3710,null,null,2120]
[10583050,"BROADSTAR 50 Lb Bag","BROADSTAR","50 lb. bag",{"$f":"CONCATENATE(C12,D12,$A$1)","v":"BROADSTAR50 lb. bagEOP 1"},{"$f":"CONCATENATE(C12,D12,$A$2)","v":"BROADSTAR50 lb. bagEOP 2"},15,null,null,3]
[10701401,"CELERO 4x1 Lb Case","CELERO","1 lb. bottle","CELERO1 lb. bottleEOP 1","CELERO1 lb. bottleEOP 2",35,null,null,4]
[10701401,"CELERO 4x1 Lb Case","CELERO","1 lb. bottle Volume 4+",{"$f":"CONCATENATE(C14,D14,$A$1)","v":"CELERO1 lb. bottle Volume 4+EOP 1"},{"$f":"CONCATENATE(C14,D14,$A$2)","v":"CELERO1 lb. bottle Volume 4+EOP 2"},null,55,null,0]
[10699170,"CERTAINTY 10x1.25 Wt oz Case","CERTAINTY","1.25 wt oz. bottle","CERTAINTY1.25 wt oz. bottleEOP 1","CERTAINTY1.25 wt oz. bottleEOP 2",30,null,null,2]
[10555225,"CHANGE UP 2x2.5 Gallon Case","CHANGE UP","2.5 gal. bottle","CHANGE UP2.5 gal. bottleEOP 1","CHANGE UP2.5 gal. bottleEOP 2",15,null,null,5]
[10555225,"CHANGE UP 2x2.5 Gallon Case","CHANGE UP","2.5 gal. bottle Volume 12+",{"$f":"CONCATENATE(C17,D17,$A$1)","v":"CHANGE UP2.5 gal. bottle Volume 12+EOP 1"},{"$f":"CONCATENATE(C17,D17,$A$2)","v":"CHANGE UP2.5 gal. bottle Volume 12+EOP 2"},null,20,null,0]
[10555030,"CHANGE UP 30 Gallon Drum","CHANGE UP","30 gal. drum","CHANGE UP30 gal. drumEOP 1","CHANGE UP30 gal. drumEOP 2",240,null,null,60]
[10555250,"CHANGE UP 250 Gallon Tote","CHANGE UP","250 gal. tote","CHANGE UP250 gal. toteEOP 1","CHANGE UP250 gal. toteEOP 2",2000,null,null,500]
[10070225,"COOL POWER 2x2.5 Gallon Case","COOL POWER","2.5 gal. bottle","COOL POWER2.5 gal. bottleEOP 1","COOL POWER2.5 gal. bottleEOP 2",15,null,null,5]
[10070225,"COOL POWER 2x2.5 Gallon Case","COOL POWER","2.5 gal. bottle Volume 12+",{"$f":"CONCATENATE(C21,D21,$A$1)","v":"COOL POWER2.5 gal. bottle Volume 12+EOP 1"},{"$f":"CONCATENATE(C21,D21,$A$2)","v":"COOL POWER2.5 gal. bottle Volume 12+EOP 2"},null,20,null,0]
[10070030,"COOL POWER 30 Gallon Drum","COOL POWER","30 gal. drum","COOL POWER30 gal. drumEOP 1","COOL POWER30 gal. drumEOP 2",240,null,null,60]
[10111225,"ESCALADE 2 2x2.5 Gallon Case","ESCALADE 2","2.5 gal. bottle","ESCALADE 22.5 gal. bottleEOP 1","ESCALADE 22.5 gal. bottleEOP 2",15,null,null,5]
[10111225,"ESCALADE 2 2x2.5 Gallon Case","ESCALADE 2","2.5 gal. bottle Volume 12+",{"$f":"CONCATENATE(C24,D24,$A$1)","v":"ESCALADE 22.5 gal. bottle Volume 12+EOP 1"},{"$f":"CONCATENATE(C24,D24,$A$2)","v":"ESCALADE 22.5 gal. bottle Volume 12+EOP 2"},null,20,null,0]
[10111030,"ESCALADE 2 30 Gallon Drum","ESCALADE 2","30 gal. drum","ESCALADE 230 gal. drumEOP 1","ESCALADE 230 gal. drumEOP 2",240,null,null,60]
[10111250,"ESCALADE 2 250 Gallon Tote","ESCALADE 2","250 gal. tote","ESCALADE 2250 gal. toteEOP 1","ESCALADE 2250 gal. toteEOP 2",2000,null,null,500]
[10139225,"HORSEPOWER 2x2.5 Gallon Case","HORSEPOWER","2.5 gal. bottle","HORSEPOWER2.5 gal. bottleEOP 1","HORSEPOWER2.5 gal. bottleEOP 2",15,null,null,5]
[10139225,"HORSEPOWER 2x2.5 Gallon Case","HORSEPOWER","2.5 gal. bottle Volume 12+",{"$f":"CONCATENATE(C28,D28,$A$1)","v":"HORSEPOWER2.5 gal. bottle Volume 12+EOP 1"},{"$f":"CONCATENATE(C28,D28,$A$2)","v":"HORSEPOWER2.5 gal. bottle Volume 12+EOP 2"},null,20,null,0]
[10139030,"HORSEPOWER 30 Gallon Drum","HORSEPOWER","30 gal. drum","HORSEPOWER30 gal. drumEOP 1","HORSEPOWER30 gal. drumEOP 2",240,null,null,60]
[10139250,"HORSEPOWER 250 Gallon Tote","HORSEPOWER","250 gal. tote",{"$f":"CONCATENATE(C30,D30,$A$1)","v":"HORSEPOWER250 gal. toteEOP 1"},{"$f":"CONCATENATE(C30,D30,$A$2)","v":"HORSEPOWER250 gal. toteEOP 2"},2000,null,null,500]
[10181174,"MANOR 16x2 Wt oz Case","MANOR","2 wt oz. bottle","MANOR2 wt oz. bottleEOP 1","MANOR2 wt oz. bottleEOP 2",4,null,null,2]
[10181880,"MANOR 8x8 Wt oz Case","MANOR","8 wt oz. bottle","MANOR8 wt oz. bottleEOP 1","MANOR8 wt oz. bottleEOP 2",16,null,null,8]
[10195225,"MILLENNIUM ULTRA 2 2x2.5 Gallon Case","MILLENNIUM ULTRA 2","2.5 gal. bottle","MILLENNIUM ULTRA 22.5 gal. bottleEOP 1","MILLENNIUM ULTRA 22.5 gal. bottleEOP 2",10,null,null,5]
[10195225,"MILLENNIUM ULTRA 2 2x2.5 Gallon Case","MILLENNIUM ULTRA 2","2.5 gal. bottle Volume 6+",{"$f":"CONCATENATE(C34,D34,$A$1)","v":"MILLENNIUM ULTRA 22.5 gal. bottle Volume 6+EOP 1"},{"$f":"CONCATENATE(C34,D34,$A$2)","v":"MILLENNIUM ULTRA 22.5 gal. bottle Volume 6+EOP 2"},null,50,null,0]
[10195030,"MILLENNIUM ULTRA 2 30 Gallon Drum","MILLENNIUM ULTRA 2","30 gal. drum","MILLENNIUM ULTRA 230 gal. drumEOP 1","MILLENNIUM ULTRA 230 gal. drumEOP 2",600,null,null,60]
[10895998,"SOUTHPAW 12x16 Wt oz Case","SOUTHPAW","16 wt oz. bottle",{"$f":"CONCATENATE(C36,D36,$A$1)","v":"SOUTHPAW16 wt oz. bottleEOP 1"},{"$f":"CONCATENATE(C36,D36,$A$2)","v":"SOUTHPAW16 wt oz. bottleEOP 2"},5,null,null,3]
[10895045,"SOUTHPAW 4x5 Lb Case","SOUTHPAW","5 lb. bottle",{"$f":"CONCATENATE(C37,D37,$A$1)","v":"SOUTHPAW5 lb. bottleEOP 1"},{"$f":"CONCATENATE(C37,D37,$A$2)","v":"SOUTHPAW5 lb. bottleEOP 2"},25,null,null,10]
[10895045,"SOUTHPAW 4x5 Lb Case","SOUTHPAW","5 lb. bottle Volume 4+",{"$f":"CONCATENATE(C38,D38,$A$1)","v":"SOUTHPAW5 lb. bottle Volume 4+EOP 1"},{"$f":"CONCATENATE(C38,D38,$A$2)","v":"SOUTHPAW5 lb. bottle Volume 4+EOP 2"},null,50,null,0]
[10874861,"SUREGUARD EZ 8x1 Pt Case","SUREGUARD EZ","1 pt. bottle","SUREGUARD EZ1 pt. bottleEOP 1","SUREGUARD EZ1 pt. bottleEOP 2",6,null,null,2]
[10874464,"SUREGUARD EZ 4x64 Fl oz Case","SUREGUARD EZ","64 fl oz. bottle",{"$f":"CONCATENATE(C40,D40,$A$1)","v":"SUREGUARD EZ64 fl oz. bottleEOP 1"},{"$f":"CONCATENATE(C40,D40,$A$2)","v":"SUREGUARD EZ64 fl oz. bottleEOP 2"},25,null,null,5]
{"$rows_left_out":98}